BDBM50148890 CHEMBL121183::[3-(3-Methoxy-phenyl)-2,5-dimethyl-3H-pyrazolo[1,5-a]pyrimidin-7-yl]-dipropyl-amine
SMILES CCCN(CCC)c1cc(C)nc2c(c(C)nn12)-c1cccc(OC)c1
InChI Key InChIKey=SWXAFTOZXIXHOX-UHFFFAOYSA-N
Data  1 KI
  Tab Delimited (TSV)   2D SDfile   Computed 3D by Vconf -m prep SDfile
Find this compound or compounds like it in BindingDB:
Activity Spreadsheet -- Enzyme Inhibition Constant Data from BindingDB
Found 1 hit for monomerid = 50148890
TargetCorticotropin-releasing factor receptor 1(Homo sapiens (Human))
Neurocrine Biosciences
Curated by ChEMBL
LigandPNGBDBM50148890(CHEMBL121183 | [3-(3-Methoxy-phenyl)-2,5-dimethyl-...)
Affinity DataKi:  24nM. Assay description: Binding affinity to the cloned human corticotropin releasing factor receptor 1
In DepthDetails ArticlePubMed